Target
Xanthine dehydrogenase/oxidase
Ligand
BDBM50109609
Substrate
Meas. Tech.
Determination of Xanthine Oxidase Inhibitory Activity of Aryl Benzofuran Amidated Derivatives and Reagents (Amino Derivatives)
IC50
>60000±n/a nM
Citation
 Chen, J Type of aryl benzofuran amidated derivative and medical use thereof US Patent  US11021454 Publication Date 6/1/2021 
Target
Name:
Xanthine dehydrogenase/oxidase
Synonyms:
XD XDHA XO Xanthine dehydrogenase/oxidase | Xanthine oxidase
Type:
Enzyme
Mol. Mass.:
146441.21
Organism:
Homo sapiens (Human)
Description:
P47989
Residue:
1333
  
Inhibitor
Name:
BDBM50109609
Synonyms:
(2R)-2-amino-3-mercaptopropanoic acid (R)-2-amino-3-mercaptopropanoic acid CYSTEINE L-Cystein L-cysteine | US11021454, Compound L-cys
Type:
Small organic molecule
Emp. Form.:
C3H7NO2S
Mol. Mass.:
121.158
SMILES:
N[C@@H](CS)C(O)=O
: