Target
Microtubule-associated proteins 1A/1B light chain 3B
Ligand
BDBM500086
Substrate
Meas. Tech.
Assay Targeting LC3B
IC50
275±n/a nM
Citation
 Yao, ZLuo, CXie, YYue, LWan, WZhang, YJiang, HChen, K Class of isoindolone-imide ring-1,3-dione-2-ene compounds, composition and use thereof US Patent  US11021457 Publication Date 6/1/2021 
Target
Name:
Microtubule-associated proteins 1A/1B light chain 3B
Synonyms:
Autophagy-related protein LC3 B MAP1 light chain 3-like protein 2 MAP1A/MAP1B light chain 3 B MAP1LC3B Microtubule-associated protein 1 light chain 3 beta
Type:
Protein
Mol. Mass.:
14691.38
Organism:
Human
Description:
Q9GZQ8
Residue:
125
  
Inhibitor
Name:
BDBM500086
Synonyms:
US11021457, Compound 93
Type:
Small organic molecule
Emp. Form.:
C36H40N6O6
Mol. Mass.:
652.7394
SMILES:
O=C(Nc1cccc2C(=O)N(Cc12)C1CCC(=O)NC1=O)\C=C/CN1CCN(CCNC=C2C(=O)CC(CC2=O)c2ccccc2)CC1
: