Target
Stimulator of interferon genes protein [139-379,H232R]
Ligand
BDBM501193
Substrate
Meas. Tech.
STING Human Cell Reporter Assay
EC50
1810±n/a nM
Citation
 Emanuel, SRichter, MConnolly, PJEdwards, JPWang, GThatikonda, SKBeigelman, LZhong, MBignan, G Cyclic dinucleotides as sting agonists US Patent  US11021511 Publication Date 6/1/2021 
Target
Name:
Stimulator of interferon genes protein [139-379,H232R]
Synonyms:
ERIS STING STING_HUMAN TMEM173
Type:
Enzyme Catalytic Domain
Mol. Mass.:
27090.78
Organism:
Homo sapiens (Human)
Description:
Residue:
241
  
Inhibitor
Name:
BDBM501193
Synonyms:
US11021511, Compound 1
Type:
Small organic molecule
Emp. Form.:
C21H26N10O13P2
Mol. Mass.:
688.4379
SMILES:
CC1(O)C(OC2COP(O)(=O)OC3C(O)C(COP(O)(=O)OC12)OC3n1cnc2c1nc(N)[nH]c2=O)n1cnc2c(N)ncnc12
: