Target
Stimulator of interferon genes protein [139-379,H232R]
Ligand
BDBM501363
Substrate
Meas. Tech.
STING Human Cell Reporter Assay
EC50
107±n/a nM
Citation
 Emanuel, SRichter, MConnolly, PJEdwards, JPWang, GThatikonda, SKBeigelman, LZhong, MBignan, G Cyclic dinucleotides as sting agonists US Patent  US11021511 Publication Date 6/1/2021 
Target
Name:
Stimulator of interferon genes protein [139-379,H232R]
Synonyms:
ERIS STING STING_HUMAN TMEM173
Type:
Enzyme Catalytic Domain
Mol. Mass.:
27090.78
Organism:
Homo sapiens (Human)
Description:
Residue:
241
  
Inhibitor
Name:
BDBM501363
Synonyms:
US11021511, Compound 6b
Type:
Small organic molecule
Emp. Form.:
C21H25FN10O10P2S2
Mol. Mass.:
722.56
SMILES:
CO[C@@H]1[C@H]2CO[P@@](S)(=O)O[C@@H]3[C@@H](CO[P@](S)(=O)O[C@H]1[C@@H](O2)n1cnc2c1nc(N)[nH]c2=O)O[C@H]([C@@H]3F)n1cnc2c(N)ncnc12
: