Target
[Pyruvate dehydrogenase (acetyl-transferring)] kinase isozyme 2, mitochondrial
Ligand
BDBM501380
Substrate
Meas. Tech.
Isothermal Titration Calorimetry
Kd
120±n/a nM
Citation
 Buchstaller, H Piperidinyl-propanone derivatives US Patent  US11026936 Publication Date 6/8/2021 
Target
Name:
[Pyruvate dehydrogenase (acetyl-transferring)] kinase isozyme 2, mitochondrial
Synonyms:
PDHK2 PDK2_HUMAN Pyruvate dehydrogenase kinase isoenzyme 1 (PDK2)
Type:
Enzyme
Mol. Mass.:
46153.78
Organism:
Homo sapiens (Human)
Description:
Q15119
Residue:
407
  
Inhibitor
Name:
BDBM501380
Synonyms:
US11026936, Compound A10
Type:
Small organic molecule
Emp. Form.:
C20H30F3N3O3
Mol. Mass.:
417.4657
SMILES:
CC(C)(C1CCN(CC1)C(=O)[C@@](C)(O)C(F)(F)F)c1nnc(o1)C1CCCCC1
: