Target
[Pyruvate dehydrogenase (acetyl-transferring)] kinase isozyme 2, mitochondrial
Ligand
BDBM501394
Substrate
Meas. Tech.
Biochemical Activity Assay
IC50
100±n/a nM
Citation
 Buchstaller, H Piperidinyl-propanone derivatives US Patent  US11026936 Publication Date 6/8/2021 
Target
Name:
[Pyruvate dehydrogenase (acetyl-transferring)] kinase isozyme 2, mitochondrial
Synonyms:
PDHK2 PDK2_HUMAN Pyruvate dehydrogenase kinase isoenzyme 1 (PDK2)
Type:
Enzyme
Mol. Mass.:
46153.78
Organism:
Homo sapiens (Human)
Description:
Q15119
Residue:
407
  
Inhibitor
Name:
BDBM501394
Synonyms:
US11026936, Compound A25
Type:
Small organic molecule
Emp. Form.:
C22H26F3N3O3
Mol. Mass.:
437.4553
SMILES:
C[C@@H]1CN(CC[C@@H]1C1(CC1)c1nnc(o1)-c1ccc(C)cc1)C(=O)[C@@](C)(O)C(F)(F)F
: