Target
Neuronal acetylcholine receptor subunit alpha-7
Ligand
BDBM501621
Substrate
Meas. Tech.
Electrophysiology Assay
EC50
1000±n/a nM
Citation
 Crowley, BMBell, IMHarvey, AJCampbell, BTGreshock, TJRada, VL Substituted 6-membered aryl or heteroaryl allosteric modulators of nicotinic acetylcholine receptors US Patent  US11026958 Publication Date 6/8/2021 
Target
Name:
Neuronal acetylcholine receptor subunit alpha-7
Synonyms:
ACHA7_HUMAN Cholinergic, Nicotinic Alpha7 Neuronal acetylcholine receptor protein alpha-7 subunit Nicotinic acetylcholine receptor alpha-7 (alpha7 nAChR)
Type:
Mol. Mass.:
56448.33
Organism:
Homo sapiens (Human)
Description:
CHRNA7 (NACHRA7)
Residue:
502
  
Inhibitor
Name:
BDBM501621
Synonyms:
US11026958, Example G4
Type:
Small organic molecule
Emp. Form.:
C17H20N2O3S
Mol. Mass.:
332.417
SMILES:
CC(C)Oc1ccc(cn1)C1CC1c1ccc(cc1)S(N)(=O)=O
: