Target
Heat shock protein HSP 90-alpha
Ligand
BDBM501629
Substrate
Meas. Tech.
Fluorescence Polarization Assay
Kd
340±70 nM
Citation
 Blagg, BSCrowley, VM Second generation GRP94-selective inhibitors US Patent  US11028041 Publication Date 6/8/2021 
Target
Name:
Heat shock protein HSP 90-alpha
Synonyms:
HS90A_HUMAN HSP86 HSP90AA1 HSPCA Heat shock 86 kDa Heat shock protein HSP 90-alpha (HSP90) LAP-2 Lipopolysaccharide-associated protein 2 heat shock protein 90kDa alpha (cytosolic), class A member 1 isoform 2
Type:
Molecular Chaperone
Mol. Mass.:
84623.45
Organism:
Homo sapiens (Human)
Description:
P07900
Residue:
732
  
Inhibitor
Name:
BDBM501629
Synonyms:
US11028041, Compound 20
Type:
Small organic molecule
Emp. Form.:
C23H22ClNO4
Mol. Mass.:
411.878
SMILES:
COC(=O)c1c(O)cc(O)c(Cl)c1CCc1ccc(N)cc1Cc1ccccc1
: