Target
Endoplasmin
Ligand
BDBM50450703
Substrate
Meas. Tech.
Fluorescence Polarization Assay
Kd
540±50 nM
Citation
 Blagg, BSCrowley, VM Second generation GRP94-selective inhibitors US Patent  US11028041 Publication Date 6/8/2021 
Target
Name:
Endoplasmin
Synonyms:
ENPL_CANLF HSP90B1 TRA1
Type:
PROTEIN
Mol. Mass.:
92464.42
Organism:
Canis familiaris
Description:
ChEMBL_1478277
Residue:
804
  
Inhibitor
Name:
BDBM50450703
Synonyms:
CHEMBL4159086 | US11028041, Compound 30
Type:
Small organic molecule
Emp. Form.:
C23H20ClFO4
Mol. Mass.:
414.854
SMILES:
COC(=O)c1c(O)cc(O)c(Cl)c1CCc1ccccc1Cc1ccc(F)cc1
: