Target
Dihydroorotate dehydrogenase (quinone), mitochondrial
Ligand
BDBM501649
Substrate
Meas. Tech.
Inhibitory Enzyme Activity (In Vitro Assay)
IC50
55±n/a nM
Citation
 Thunuguntla, SSHosahalli, SPanigrahi, SKSchwarz, MArit, M 1, 4, 6-trisubstituted-2-alkyl-1H-benzo[d]imidazole derivatives as dihydroorotate oxygenase inhibitors US Patent  US11028054 Publication Date 6/8/2021 
Target
Name:
Dihydroorotate dehydrogenase (quinone), mitochondrial
Synonyms:
DHODH Dihydroorotate dehydrogenase Dihydroorotate dehydrogenase, mitochondrial Dihydroorotate oxidase (DHODH) | PYRD_HUMAN
Type:
Enzyme
Mol. Mass.:
42881.33
Organism:
Homo sapiens (Human)
Description:
Q02127
Residue:
395
  
Inhibitor
Name:
BDBM501649
Synonyms:
US11028054, Example 21
Type:
Small organic molecule
Emp. Form.:
C22H17FN2O3
Mol. Mass.:
376.3804
SMILES:
COc1cccc(-c2ccc(cc2)-c2cc(C(O)=O)c3nc(C)[nH]c3c2)c1F
: