Target
Dihydroorotate dehydrogenase (quinone), mitochondrial
Ligand
BDBM501669
Substrate
Meas. Tech.
Inhibitory Enzyme Activity (In Vitro Assay)
IC50
55±n/a nM
Citation
 Thunuguntla, SSHosahalli, SPanigrahi, SKSchwarz, MArit, M 1, 4, 6-trisubstituted-2-alkyl-1H-benzo[d]imidazole derivatives as dihydroorotate oxygenase inhibitors US Patent  US11028054 Publication Date 6/8/2021 
Target
Name:
Dihydroorotate dehydrogenase (quinone), mitochondrial
Synonyms:
DHODH Dihydroorotate dehydrogenase Dihydroorotate dehydrogenase, mitochondrial Dihydroorotate oxidase (DHODH) | PYRD_HUMAN
Type:
Enzyme
Mol. Mass.:
42881.33
Organism:
Homo sapiens (Human)
Description:
Q02127
Residue:
395
  
Inhibitor
Name:
BDBM501669
Synonyms:
US11028054, Example 84
Type:
Small organic molecule
Emp. Form.:
C26H21F4N3O3
Mol. Mass.:
499.4569
SMILES:
Cc1nc2c(cc(cc2[nH]1)-c1c(F)c(F)c(c(F)c1F)-c1ccc(CN2CCOCC2)cc1)C(O)=O
: