Target
Adenosine receptor A2a
Ligand
BDBM501677
Substrate
Meas. Tech.
Radioligand Binding Competition Assay
IC50
2.40±n/a nM
Citation
 Pham, SMChen, JAnsari, AJadhavar, PSPatil, VSKhan, FRamachandran, SAAgarwal, AKChakravarty, S Heterocyclic compounds as adenosine antagonists US Patent  US11028058 Publication Date 6/8/2021 
Target
Name:
Adenosine receptor A2a
Synonyms:
A2A adenosine receptor (hA2A) ADENOSINE A2 ADORA2 Adenosine A2A receptor (A2AAR)
Type:
G Protein-Coupled Receptor (GPCR)
Mol. Mass.:
44716.46
Organism:
Homo sapiens (Human)
Description:
P29274
Residue:
412
  
Inhibitor
Name:
BDBM501677
Synonyms:
US11028058, Compound 1.292
Type:
Small organic molecule
Emp. Form.:
C18H12ClN7
Mol. Mass.:
361.788
SMILES:
Cc1ccn(n1)-c1nc(N)c(nc1-c1cc(Cl)c2ncccc2c1)C#N
: