Target
Macrophage colony-stimulating factor 1 receptor
Ligand
BDBM501716
Substrate
Meas. Tech.
Biochemical Assay
IC50
550±n/a nM
Citation
 Gamage, SAShepherd, PRFlanagan, JURewcastle, GWMarshall, AJBuchanan, CMLu, GBonnet, MJamieson, SMDenny, WA Tricyclic heterocyclic derivatives and uses thereof US Patent  US11028064 Publication Date 6/8/2021 
Target
Name:
Macrophage colony-stimulating factor 1 receptor
Synonyms:
CSF1R FMS Macrophage colony stimulating factor receptor Macrophage colony-stimulating factor 1 receptor (c-FMS) Proto-oncogene c-Fms c-fms | cFMS
Type:
Protein
Mol. Mass.:
107979.48
Organism:
Homo sapiens (Human)
Description:
P07333
Residue:
972
  
Inhibitor
Name:
BDBM501716
Synonyms:
4-[3-(Dimethylamino)propoxy]-2-methyl-6-phenoxy-9H-xanthen-9-one | US11028064, Example 30
Type:
Small organic molecule
Emp. Form.:
C25H25NO4
Mol. Mass.:
403.4703
SMILES:
CN(C)CCCOc1cc(C)cc2c1oc1cc(Oc3ccccc3)ccc1c2=O
: