Target
Macrophage colony-stimulating factor 1 receptor
Ligand
BDBM501720
Substrate
Meas. Tech.
Biochemical Assay
IC50
550±n/a nM
Citation
 Gamage, SAShepherd, PRFlanagan, JURewcastle, GWMarshall, AJBuchanan, CMLu, GBonnet, MJamieson, SMDenny, WA Tricyclic heterocyclic derivatives and uses thereof US Patent  US11028064 Publication Date 6/8/2021 
Target
Name:
Macrophage colony-stimulating factor 1 receptor
Synonyms:
CSF1R FMS Macrophage colony stimulating factor receptor Macrophage colony-stimulating factor 1 receptor (c-FMS) Proto-oncogene c-Fms c-fms | cFMS
Type:
Protein
Mol. Mass.:
107979.48
Organism:
Homo sapiens (Human)
Description:
P07333
Residue:
972
  
Inhibitor
Name:
BDBM501720
Synonyms:
4-(4-(Dimethylamino)butoxy)-2-methyl-6-phenoxy-9H-xanthen-9-one | US11028064, Example 34
Type:
Small organic molecule
Emp. Form.:
C24H21BrO4
Mol. Mass.:
453.325
SMILES:
Cc1cc(OCCCCBr)c2oc3cc(Oc4ccccc4)ccc3c(=O)c2c1
: