Target
Lysine-specific histone demethylase 1A
Ligand
BDBM501797
Substrate
Meas. Tech.
In Vitro Enzyme Inhibition Assay
IC50
<100±n/a nM
Citation
 Chen, YKanouni, TStafford, JAVeal, J Inhibitors of lysine specific demethylase-1 US Patent  US11028066 Publication Date 6/8/2021 
Target
Name:
Lysine-specific histone demethylase 1A
Synonyms:
AOF2 Flavin-containing amine oxidase domain-containing protein 2 KDM1A KIAA0601 Lysine-specific demethylase 1 (LSD1) Lysine-specific histone demethylase 1 (LSD1)
Type:
Enzyme
Mol. Mass.:
92901.01
Organism:
Homo sapiens (Human)
Description:
O60341
Residue:
852
  
Inhibitor
Name:
BDBM501797
Synonyms:
4-[3-(4-cyclopropylphenyl)-4- methyl-5-oxo-6-{[(3R)-pyrrolidin- 3-ylmethyl]amino}-4,5- dihydropyrazin-2-yl]benzonitrile | US11028066, Example 35
Type:
Small organic molecule
Emp. Form.:
C26H27N5O
Mol. Mass.:
425.5255
SMILES:
Cn1c(-c2ccc(cc2)C2CC2)c(nc(NC[C@@H]2CCNC2)c1=O)-c1ccc(cc1)C#N
: