Target
Lysine-specific histone demethylase 1A
Ligand
BDBM501831
Substrate
Meas. Tech.
In Vitro Enzyme Inhibition Assay
IC50
<100±n/a nM
Citation
 Chen, YKanouni, TStafford, JAVeal, J Inhibitors of lysine specific demethylase-1 US Patent  US11028066 Publication Date 6/8/2021 
Target
Name:
Lysine-specific histone demethylase 1A
Synonyms:
AOF2 Flavin-containing amine oxidase domain-containing protein 2 KDM1A KIAA0601 Lysine-specific demethylase 1 (LSD1) Lysine-specific histone demethylase 1 (LSD1)
Type:
Enzyme
Mol. Mass.:
92901.01
Organism:
Homo sapiens (Human)
Description:
O60341
Residue:
852
  
Inhibitor
Name:
BDBM501831
Synonyms:
(S)-5-(2-(4-methoxyphenyl)-1- methyl-6-oxo-5-(pyrrolidin-3- ylmethylamino)-1,6- dihydropyridin-3-yl)picolinonitrile | US11028066, Example 69
Type:
Small organic molecule
Emp. Form.:
C24H25N5O2
Mol. Mass.:
415.4876
SMILES:
COc1ccc(cc1)-c1c(cc(NC[C@H]2CCNC2)c(=O)n1C)-c1ccc(nc1)C#N
: