Target
Lysine-specific histone demethylase 1A
Ligand
BDBM501850
Substrate
Meas. Tech.
In Vitro Enzyme Inhibition Assay
IC50
<100±n/a nM
Citation
 Chen, YKanouni, TStafford, JAVeal, J Inhibitors of lysine specific demethylase-1 US Patent  US11028066 Publication Date 6/8/2021 
Target
Name:
Lysine-specific histone demethylase 1A
Synonyms:
AOF2 Flavin-containing amine oxidase domain-containing protein 2 KDM1A KIAA0601 Lysine-specific demethylase 1 (LSD1) Lysine-specific histone demethylase 1 (LSD1)
Type:
Enzyme
Mol. Mass.:
92901.01
Organism:
Homo sapiens (Human)
Description:
O60341
Residue:
852
  
Inhibitor
Name:
BDBM501850
Synonyms:
2-[3-(4-aminopiperidyl)-5-(4- cyano-3-fluorophenyl)-6-(4- methoxyphenyl)-2- oxohydropyrazinyl]acetamide | US11028066, Example 88
Type:
Small organic molecule
Emp. Form.:
C25H25FN6O3
Mol. Mass.:
476.5028
SMILES:
COc1ccc(cc1)-c1c(nc(N2CCC(N)CC2)c(=O)n1CC(N)=O)-c1ccc(C#N)c(F)c1
: