Target
Lysine-specific histone demethylase 1A
Ligand
BDBM501854
Substrate
Meas. Tech.
In Vitro Enzyme Inhibition Assay
IC50
<100±n/a nM
Citation
 Chen, YKanouni, TStafford, JAVeal, J Inhibitors of lysine specific demethylase-1 US Patent  US11028066 Publication Date 6/8/2021 
Target
Name:
Lysine-specific histone demethylase 1A
Synonyms:
AOF2 Flavin-containing amine oxidase domain-containing protein 2 KDM1A KIAA0601 Lysine-specific demethylase 1 (LSD1) Lysine-specific histone demethylase 1 (LSD1)
Type:
Enzyme
Mol. Mass.:
92901.01
Organism:
Homo sapiens (Human)
Description:
O60341
Residue:
852
  
Inhibitor
Name:
BDBM501854
Synonyms:
4-{2-[6-(dimethylamino)(3- pyridyl)]-1-methyl-5-[4- (methylamino)piperidyl]-6-oxo-3- hydropyridyl}benzenecarbonitrile | US11028066, Example 92
Type:
Small organic molecule
Emp. Form.:
C26H30N6O
Mol. Mass.:
442.556
SMILES:
CNC1CCN(CC1)c1cc(-c2ccc(cc2)C#N)c(-c2ccc(nc2)N(C)C)n(C)c1=O
: