Target
Leucine-rich repeat serine/threonine-protein kinase 2 [G2019S]
Ligand
BDBM501992
Substrate
Meas. Tech.
Biochemical Assay
IC50
<30±n/a nM
Citation
 Estrada, AAFeng, JALyssikatos, JPSweeney, ZKde Vicente Fidalgo, J Substituted pyrimidines as LRKK2 inhibitors US Patent  US11028080 Publication Date 6/8/2021 
Target
Name:
Leucine-rich repeat serine/threonine-protein kinase 2 [G2019S]
Synonyms:
LRRK2 LRRK2_HUMAN Leucine-rich repeat serine/threonine-protein kinase 2 (LRRK2)(G2019S) PARK8
Type:
Mol. Mass.:
286143.23
Organism:
Homo sapiens (Human)
Description:
Q5S007(G2019S)
Residue:
2527
  
Inhibitor
Name:
BDBM501992
Synonyms:
US11028080, No. 48 | US11028080, No. 49
Type:
Small organic molecule
Emp. Form.:
C13H13BrClN5O2S
Mol. Mass.:
418.697
SMILES:
COc1nc(Nc2sc(nc2Cl)C2(C)CCNC2=O)ncc1Br
: