Target
Protein arginine N-methyltransferase 1
Ligand
BDBM502063
Substrate
Meas. Tech.
PRMT1 Enzymatic Assay
IC50
555±n/a nM
Citation
 Di Francesco, MEJones, PMcAfoos, TJ Ethanediamine-heterocycle derivatives as inhibitors of protein arginine methyltransferases US Patent  US11028083 Publication Date 6/8/2021 
Target
Name:
Protein arginine N-methyltransferase 1
Synonyms:
2.1.1.319 HMT2 HRMT1L2 {ECO:0000303|PubMed:11097842 IR1B4 PRMT1 Protein-arginine N-methyltransferase 1 | Synonyms=HMT2
Type:
PROTEIN
Mol. Mass.:
42451.61
Organism:
Homo sapiens
Description:
ChEMBL_100878
Residue:
371
  
Inhibitor
Name:
BDBM502063
Synonyms:
3-(4,4-bis(Ethoxy- methyl)cyclohexyl)-2- ((methyl(2-(methyl- amino)ethyl)amino)- methyl)-4,5,6,7-tetra- hydropyrazolo[1,5-a]- pyridin-6-ol | US11028083, Example 57
Type:
Small organic molecule
Emp. Form.:
C24H44N4O3
Mol. Mass.:
436.6312
SMILES:
CCOCC1(COCC)CCC(CC1)c1c(CN(C)CCNC)nn2CC(O)CCc12
: