Target
Histone-arginine methyltransferase CARM1
Ligand
BDBM502027
Substrate
Meas. Tech.
RapidFire Mass Spectrometry Selectivity Assay
IC50
1124±n/a nM
Citation
 Di Francesco, MEJones, PMcAfoos, TJ Ethanediamine-heterocycle derivatives as inhibitors of protein arginine methyltransferases US Patent  US11028083 Publication Date 6/8/2021 
Target
Name:
Histone-arginine methyltransferase CARM1
Synonyms:
CARM1 Coactivator-associated arginine methyltransferase 1 PRMT4 Protein arginine methyltransferase 4 (PRMT4)
Type:
Protein
Mol. Mass.:
65855.47
Organism:
Homo sapiens (Human)
Description:
Q86X55
Residue:
608
  
Inhibitor
Name:
BDBM502027
Synonyms:
N1-((3-cyclohexyl- 4,5,6,7-tetrahydro- pyrazolo[1,5-a]- pyridin-2-yl)methyl)- N1,N2-dimethylethane- 1,2-diamine | US11028083, Example 21
Type:
Small organic molecule
Emp. Form.:
C18H32N4
Mol. Mass.:
304.4735
SMILES:
CNCCN(C)Cc1nn2CCCCc2c1C1CCCCC1
: