Target
Bromodomain-containing protein 4
Ligand
BDBM502344
Substrate
Meas. Tech.
Evaluation of BRD4 binding inhibition ability
IC50
0.600±n/a nM
Citation
 Lee, KChoi, GAli, ILee, JYLee, JSPark, WJKim, YTKim, SHKim, JHLim, J [1,2,4]Triazolo[4,3-a]quinoxaline derivative, method for preparing same, and pharmaceutical composition for preventing or treating BET protein-related diseases, containing same as active ingredient US Patent  US11028090 Publication Date 6/8/2021 
Target
Name:
Bromodomain-containing protein 4
Synonyms:
BRD4 Bromodomain-containing protein 4 (BRD4) Protein HUNK1
Type:
Protein
Mol. Mass.:
152264.84
Organism:
Homo sapiens (Human)
Description:
O60885
Residue:
1362
  
Inhibitor
Name:
BDBM502344
Synonyms:
2-methoxy-N- {4-[1-methyl- 7-(1-methyl- 1H-benzo- imidazole-2- yl)-[1,2,4]tri- azolo[4,3- a]quinoxaline- 4-ylamino]- butyl}- benzamide | US11028090, Example 237
Type:
Small organic molecule
Emp. Form.:
C30H30N8O2
Mol. Mass.:
534.6116
SMILES:
COc1ccccc1C(=O)NCCCCNc1nc2cc(ccc2n2c(C)nnc12)-c1nc2ccccc2n1C
: