Target
Bromodomain-containing protein 4
Ligand
BDBM502481
Substrate
Meas. Tech.
Evaluation of BRD4 binding inhibition ability
IC50
1.000±n/a nM
Citation
 Lee, KChoi, GAli, ILee, JYLee, JSPark, WJKim, YTKim, SHKim, JHLim, J [1,2,4]Triazolo[4,3-a]quinoxaline derivative, method for preparing same, and pharmaceutical composition for preventing or treating BET protein-related diseases, containing same as active ingredient US Patent  US11028090 Publication Date 6/8/2021 
Target
Name:
Bromodomain-containing protein 4
Synonyms:
BRD4 Bromodomain-containing protein 4 (BRD4) Protein HUNK1
Type:
Protein
Mol. Mass.:
152264.84
Organism:
Homo sapiens (Human)
Description:
O60885
Residue:
1362
  
Inhibitor
Name:
BDBM502481
Synonyms:
(S)-(1-{4-[7- (2-methoxy- ethoxy)-1- methyl- [1,2,4]tri- azolo[4,3- a]quinoxaline- 4-ylamino]- butylcarbamo- yl}-2-methyl- | US11028090, Example 400
Type:
Small organic molecule
Emp. Form.:
C26H39N7O5
Mol. Mass.:
529.6318
SMILES:
COCCOc1ccc2c(c1)nc(NCCCCNC(=O)[C@@H](NC(=O)OC(C)C)C(C)C)c1nnc(C)n21
: