Target
Tryptophan 5-hydroxylase 1
Ligand
BDBM445690
Substrate
Meas. Tech.
In Vitro Enzyme Activity Assay
IC50
217±25 nM
Citation
 Bader, MSpecker, EMatthes, SSchütz, AMallow, KGrohmann, MNazaré, M Xanthine derivatives, their use as a medicament, and pharmaceutical preparations comprising the same US Patent  US11028104 Publication Date 6/8/2021 
Target
Name:
Tryptophan 5-hydroxylase 1
Synonyms:
TPH TPH1_HUMAN TRPH | Tryptophan 5-monooxygenase 1
Type:
PROTEIN
Mol. Mass.:
50990.64
Organism:
Homo sapiens (Human)
Description:
ChEMBL_1361824
Residue:
444
  
Inhibitor
Name:
BDBM445690
Synonyms:
Ex. 26/KM-06-114/(I-26) US11028104, Example 26
Type:
Small organic molecule
Emp. Form.:
C21H19FN6O2S
Mol. Mass.:
438.478
SMILES:
CCn1c2nc(Cc3cn4cc(C)sc4n3)n(Cc3ccc(F)cc3)c2c(=O)[nH]c1=O
: