Target
Tryptophan 5-hydroxylase 1
Ligand
BDBM502730
Substrate
Meas. Tech.
In Vitro Enzyme Activity Assay
IC50
770±90 nM
Citation
 Bader, MSpecker, EMatthes, SSchütz, AMallow, KGrohmann, MNazaré, M Xanthine derivatives, their use as a medicament, and pharmaceutical preparations comprising the same US Patent  US11028104 Publication Date 6/8/2021 
Target
Name:
Tryptophan 5-hydroxylase 1
Synonyms:
TPH TPH1_HUMAN TRPH | Tryptophan 5-monooxygenase 1
Type:
PROTEIN
Mol. Mass.:
50990.64
Organism:
Homo sapiens (Human)
Description:
ChEMBL_1361824
Residue:
444
  
Inhibitor
Name:
BDBM502730
Synonyms:
US11028104, Example LX1606
Type:
Small organic molecule
Emp. Form.:
C25H22ClF3N6O3
Mol. Mass.:
546.929
SMILES:
Cc1ccn(n1)-c1cc(Cl)ccc1[C@@H](Oc1cc(nc(N)n1)-c1ccc(CC(N)C(O)=O)cc1)C(F)(F)F
: