Target
Tryptophan 5-hydroxylase 2
Ligand
BDBM445672
Substrate
Meas. Tech.
In Vitro Enzyme Activity Assay
IC50
17.0±1 nM
Citation
 Bader, MSpecker, EMatthes, SSchütz, AMallow, KGrohmann, MNazaré, M Xanthine derivatives, their use as a medicament, and pharmaceutical preparations comprising the same US Patent  US11028104 Publication Date 6/8/2021 
Target
Name:
Tryptophan 5-hydroxylase 2
Synonyms:
NTPH TPH2_HUMAN
Type:
PROTEIN
Mol. Mass.:
56055.12
Organism:
Homo sapiens (Human)
Description:
ChEMBL_487490
Residue:
490
  
Inhibitor
Name:
BDBM445672
Synonyms:
Ex. 10/KM-06-90/(I-10) US11028104, Example 10
Type:
Small organic molecule
Emp. Form.:
C25H21N7O2S
Mol. Mass.:
483.545
SMILES:
CCn1c2nc(Cc3cn4ccccc4n3)n(Cc3ccc(cc3)-c3nccs3)c2c(=O)[nH]c1=O
: