Target
Tryptophan 5-hydroxylase 2
Ligand
BDBM445674
Substrate
Meas. Tech.
In Vitro Enzyme Activity Assay
IC50
20.0±3 nM
Citation
 Bader, MSpecker, EMatthes, SSchütz, AMallow, KGrohmann, MNazaré, M Xanthine derivatives, their use as a medicament, and pharmaceutical preparations comprising the same US Patent  US11028104 Publication Date 6/8/2021 
Target
Name:
Tryptophan 5-hydroxylase 2
Synonyms:
NTPH TPH2_HUMAN
Type:
PROTEIN
Mol. Mass.:
56055.12
Organism:
Homo sapiens (Human)
Description:
ChEMBL_487490
Residue:
490
  
Inhibitor
Name:
BDBM445674
Synonyms:
Ex. 12/KM-06-93/(I-12) US11028104, Example 12
Type:
Small organic molecule
Emp. Form.:
C25H22N8O3
Mol. Mass.:
482.494
SMILES:
CCn1c2nc(Cc3cn4ccccc4n3)n(Cc3ccc(cc3)-c3nc(C)no3)c2c(=O)[nH]c1=O
: