Target
Muscarinic acetylcholine receptor M4
Ligand
BDBM502823
Substrate
Meas. Tech.
Binding Assay
Ki
<10±n/a nM
Citation
 Harriott, NPagano, N Compounds of formulas (VII), (VIII), (IX), (XI), (XII), (XIII), and (XIV) as muscarinic receptor 4(M4) antagonists for treating neurological diseases US Patent  US11033539 Publication Date 6/15/2021 
Target
Name:
Muscarinic acetylcholine receptor M4
Synonyms:
ACM4_HUMAN Cholinergic, muscarinic M4 Muscarinic acetylcholine receptor M2 and M4
Type:
Enzyme Catalytic Domain
Mol. Mass.:
53079.31
Organism:
Homo sapiens (Human)
Description:
Cholinergic, muscarinic M4 CHRM4 HUMAN M3::P08173
Residue:
479
  
Inhibitor
Name:
BDBM502823
Synonyms:
(2R)-N-[2-(1-benzylpiperidin-4-yl)ethyl]-4-[5-cyano-4- (methylamino)pyrimidin-2-yl]-2-methylpiperazine-1-carboxamide | US11033539, Cpd. No. 5-23
Type:
Small organic molecule
Emp. Form.:
C26H36N8O
Mol. Mass.:
476.617
SMILES:
CNc1nc(ncc1C#N)N1CCN([C@H](C)C1)C(=O)NCCC1CCN(Cc2ccccc2)CC1
: