Target
Muscarinic acetylcholine receptor M4
Ligand
BDBM502998
Substrate
Meas. Tech.
Binding Assay
Ki
<10±n/a nM
Citation
 Harriott, NPagano, N Compounds of formulas (VII), (VIII), (IX), (XI), (XII), (XIII), and (XIV) as muscarinic receptor 4(M4) antagonists for treating neurological diseases US Patent  US11033539 Publication Date 6/15/2021 
Target
Name:
Muscarinic acetylcholine receptor M4
Synonyms:
ACM4_HUMAN Cholinergic, muscarinic M4 Muscarinic acetylcholine receptor M2 and M4
Type:
Enzyme Catalytic Domain
Mol. Mass.:
53079.31
Organism:
Homo sapiens (Human)
Description:
Cholinergic, muscarinic M4 CHRM4 HUMAN M3::P08173
Residue:
479
  
Inhibitor
Name:
BDBM502998
Synonyms:
N-[2-(1-benzyl-4-hydroxypiperidin-4-yl)ethyl]-1-[3-fluoro-4- (trifluoromethoxy)phenyl]piperidine-4-carboxamide US11033539, Cpd. No. 9-9
Type:
Small organic molecule
Emp. Form.:
C27H33F4N3O3
Mol. Mass.:
523.5628
SMILES:
OC1(CCNC(=O)C2CCN(CC2)c2ccc(OC(F)(F)F)c(F)c2)CCN(Cc2ccccc2)CC1
: