Target
Tyrosine-protein phosphatase non-receptor type 11
Ligand
BDBM503366
Substrate
Meas. Tech.
Biochemical Assay
IC50
6200±n/a nM
Citation
 Jorand-LeBrun, CBoivin, RMochalkin, IJohnson, TLinde, NMusch, DKumar, D Carboxamide-pyrimidine derivatives as SHP2 antagonists US Patent  US11033547 Publication Date 6/15/2021 
Target
Name:
Tyrosine-protein phosphatase non-receptor type 11
Synonyms:
PTN11_HUMAN PTP-2C PTPN11 Protein tyrosine phosphatase (PTP) Shp2 Protein-tyrosine phosphatase 2C SHP2 Src homology phosphatase 2 (SHP-2) Tyrosine-protein phosphatase non-receptor type 11 (PTPN11) Tyrosine-protein phosphatase non-receptor type 11 (SHP2)
Type:
Protein phosphatase
Mol. Mass.:
68443.59
Organism:
Homo sapiens (Human)
Description:
Q06124
Residue:
597
  
Inhibitor
Name:
BDBM503366
Synonyms:
2-(3,9-Diaza-bicyclo[4.2.1]-non-3- yl)-5-(2,3-dichloro-phenyl)-6- methyl-pyrimidine-4-carboxylic acid amide US11696916, Compound 68
Type:
Small organic molecule
Emp. Form.:
C19H21Cl2N5O
Mol. Mass.:
406.309
SMILES:
Cc1nc(nc(C(N)=O)c1-c1cccc(Cl)c1Cl)N1CCC2CCC(C1)N2
: