Target
Tyrosine-protein phosphatase non-receptor type 11
Ligand
BDBM503373
Substrate
Meas. Tech.
Biochemical Assay
IC50
2100±n/a nM
Citation
 Jorand-LeBrun, CBoivin, RMochalkin, IJohnson, TLinde, NMusch, DKumar, D Carboxamide-pyrimidine derivatives as SHP2 antagonists US Patent  US11033547 Publication Date 6/15/2021 
Target
Name:
Tyrosine-protein phosphatase non-receptor type 11
Synonyms:
3.1.3.48 PTP-1D PTP2C Protein Tyrosine Phosphatase PPN11/Shp2 Protein-Tyrosine Phosphatase SHP-2 Protein-tyrosine phosphatase 2C SH-PTP3 SHP2 Src homology phosphatase 2 (SHP-2) Tyrosine-protein phosphatase non-receptor type 11 (SHP-2) | Tyrosine-protein phosphatase non-receptor type 11 (SHP2)
Type:
Protein phosphatase
Mol. Mass.:
68443.59
Organism:
Homo sapiens (Human)
Description:
Q06124
Residue:
593
  
Inhibitor
Name:
BDBM503373
Synonyms:
2-((3aS,4R,6aR)-4-Amino- hexahydro-cyclopenta[c]pyrrol-2- yl)-5-(2,3-dichloro-phenyl)-6- methyl-pyrimidine-4-carboxylic acid amide US11696916, Compound 75
Type:
Small organic molecule
Emp. Form.:
C19H21Cl2N5O
Mol. Mass.:
406.309
SMILES:
Cc1nc(nc(C(N)=O)c1-c1cccc(Cl)c1Cl)N1C[C@@H]2CC[C@@H](N)[C@@H]2C1
: