Target
Nuclear receptor ROR-gamma
Ligand
BDBM503475
Substrate
Meas. Tech.
Fluorescence Based Assay
Kd
1.70±n/a nM
Citation
 Goldberg, SMartin, CLFennema, EGWolin, RLFourie, AMXue, X Pyridinyl pyrazoles as modulators of RORγT US Patent  US11034658 Publication Date 6/15/2021 
Target
Name:
Nuclear receptor ROR-gamma
Synonyms:
NR1F3 Nuclear receptor ROR-gamma (RORC) RAR-related orphan receptor C (RORc) RORG RZRG Retinoid-related orphan receptor-gamma (RORc)
Type:
Enzyme Catalytic Domain
Mol. Mass.:
58218.40
Organism:
Homo sapiens (Human)
Description:
P51449
Residue:
518
  
Inhibitor
Name:
BDBM503475
Synonyms:
4-Chloro-5-(2-(difluoromethoxy)-6-(3,3,3-trifluoro-2,2-dimethylpropyl)pyridin-3-yl)-N-(((1R*,2R*,4R*)-1,2-dihydroxy-4-(methylsulfonyl)cyclohexyl)methyl)-1-ethyl-1H-pyrazole-3-carboxamide | US11034658, Example 47
Type:
Small organic molecule
Emp. Form.:
C25H32ClF5N4O4
Mol. Mass.:
582.991
SMILES:
CCn1nc(C(=O)NC[C@]2(O)CC[C@@H](C)C[C@H]2O)c(Cl)c1-c1ccc(CC(C)(C)C(F)(F)F)nc1OC(F)F
: