Target
Nuclear receptor ROR-gamma
Ligand
BDBM503488
Substrate
Meas. Tech.
Fluorescence Based Assay
Kd
11.0±n/a nM
Citation
 Goldberg, SMartin, CLFennema, EGWolin, RLFourie, AMXue, X Pyridinyl pyrazoles as modulators of RORγT US Patent  US11034658 Publication Date 6/15/2021 
Target
Name:
Nuclear receptor ROR-gamma
Synonyms:
NR1F3 Nuclear receptor ROR-gamma (RORC) RAR-related orphan receptor C (RORc) RORG RZRG Retinoid-related orphan receptor-gamma (RORc)
Type:
Enzyme Catalytic Domain
Mol. Mass.:
58218.40
Organism:
Homo sapiens (Human)
Description:
P51449
Residue:
518
  
Inhibitor
Name:
BDBM503488
Synonyms:
4-Chloro-1-ethyl-5-(4-methoxy-6-(3,3,3-trifluoro-2-methylpropyl)pyridin-3-yl)-N-(((1r,4r)-4-(methylsulfonyl)cyclohexyl)methyl)-1H-pyrazole-3-carboxamide | US11034658, Example 60
Type:
Small organic molecule
Emp. Form.:
C24H32ClF3N4O2
Mol. Mass.:
500.985
SMILES:
CCn1nc(C(=O)NC[C@H]2CC[C@H](C)CC2)c(Cl)c1-c1cnc(CC(C)C(F)(F)F)cc1OC
: