Target
Indoleamine 2,3-dioxygenase 1
Ligand
BDBM503507
Substrate
Meas. Tech.
Enzyme Assay
IC50
985±n/a nM
Citation
 Guo, LHan, YLiu, KHe, SKozlowski, JNargund, RYu, WZhang, HPu, QLi, DAchab, ALi, G Substituted N′-hydroxycarbamimidoyl-1,2,5-oxadiazole compounds as indoleamine 2,3-dioxygenase IDO inhibitors US Patent  US11034661 Publication Date 6/15/2021 
Target
Name:
Indoleamine 2,3-dioxygenase 1
Synonyms:
I23O1_HUMAN IDO-1 INDO Indoleamine 2,3-dioxygenase | Indoleamine-pyrrole 2,3-dioxygenase
Type:
Enzyme
Mol. Mass.:
45330.80
Organism:
Homo sapiens (Human)
Description:
P14902
Residue:
403
  
Inhibitor
Name:
BDBM503507
Synonyms:
2-({4-[N-(4- fluorobicyclo[4.2.0]octa-1,3,5-trien- 7-yl)-N'-hydroxycarbamimidoyl]- 1,2,5-oxadiazol-3-yl}oxy)-N-(2- hydroxy-2-methylpropyl)acetamide | US11034661, Example 14
Type:
Small organic molecule
Emp. Form.:
C17H20FN5O5
Mol. Mass.:
393.3696
SMILES:
CC(C)(O)CNC(=O)COc1nonc1\C(NC1Cc2ccc(F)cc12)=N\O
: