Target
Poly [ADP-ribose] polymerase 2
Ligand
BDBM503561
Substrate
Meas. Tech.
Scintillation Proximity Assay
IC50
181±n/a nM
Citation
 Takahashi, TKluge, ALagu, BJi, N Poly-ADP ribose polymerase (PARP) inhibitors US Patent  US11034670 Publication Date 6/15/2021 
Target
Name:
Poly [ADP-ribose] polymerase 2
Synonyms:
(ARTD2 or PARP2) ADPRTL2 PARP2_HUMAN Poly [ADP-ribose] polymerase 2 (PARP2)
Type:
Enzyme
Mol. Mass.:
66225.70
Organism:
Homo sapiens (Human)
Description:
Q9UGN5
Residue:
583
  
Inhibitor
Name:
BDBM503561
Synonyms:
US11034670, Ex. 1
Type:
Small organic molecule
Emp. Form.:
C25H25Cl2N5O3
Mol. Mass.:
514.404
SMILES:
Clc1cc(ccc1N1CCN(CC1)C(=O)CCc1nc2c(Cl)cccc2c(=O)[nH]1)C(=O)NC1CC1
: