Target
Poly [ADP-ribose] polymerase 2
Ligand
BDBM503563
Substrate
Meas. Tech.
Scintillation Proximity Assay
IC50
196±n/a nM
Citation
 Takahashi, TKluge, ALagu, BJi, N Poly-ADP ribose polymerase (PARP) inhibitors US Patent  US11034670 Publication Date 6/15/2021 
Target
Name:
Poly [ADP-ribose] polymerase 2
Synonyms:
(ARTD2 or PARP2) ADPRTL2 PARP2_HUMAN Poly [ADP-ribose] polymerase 2 (PARP2)
Type:
Enzyme
Mol. Mass.:
66225.70
Organism:
Homo sapiens (Human)
Description:
Q9UGN5
Residue:
583
  
Inhibitor
Name:
BDBM503563
Synonyms:
US11034670, Ex. 3
Type:
Small organic molecule
Emp. Form.:
C23H24ClN5O3
Mol. Mass.:
453.921
SMILES:
CNC(=O)c1ccc(N2CCN(CC2)C(=O)CCc2nc3ccccc3c(=O)[nH]2)c(Cl)c1
: