Target
Mitogen-activated protein kinase kinase kinase 5
Ligand
BDBM503623
Substrate
Meas. Tech.
Biochemical Assay
Kd
<100±n/a nM
Citation
 Jin, BDong, QHung, G Apoptosis signal-regulating kinase inhibitors and uses thereof US Patent  US11034671 Publication Date 6/15/2021 
Target
Name:
Mitogen-activated protein kinase kinase kinase 5
Synonyms:
ASK1 MAP3K5 MEKK5
Type:
Protein
Mol. Mass.:
154514.93
Organism:
Homo sapiens (Human)
Description:
Q99683
Residue:
1374
  
Inhibitor
Name:
BDBM503623
Synonyms:
US11034671, Example 10
Type:
Small organic molecule
Emp. Form.:
C19H16BrN5O2
Mol. Mass.:
426.267
SMILES:
Brc1ccc2OCCC=CCn3cnnc3-c3cccc(NC(=O)c2c1)n3
: