Target
Mitogen-activated protein kinase kinase kinase 5
Ligand
BDBM503639
Substrate
Meas. Tech.
Biochemical Assay
Kd
750±n/a nM
Citation
 Jin, BDong, QHung, G Apoptosis signal-regulating kinase inhibitors and uses thereof US Patent  US11034671 Publication Date 6/15/2021 
Target
Name:
Mitogen-activated protein kinase kinase kinase 5
Synonyms:
ASK1 MAP3K5 MEKK5
Type:
Protein
Mol. Mass.:
154514.93
Organism:
Homo sapiens (Human)
Description:
Q99683
Residue:
1374
  
Inhibitor
Name:
BDBM503639
Synonyms:
US11034671, Example 26
Type:
Small organic molecule
Emp. Form.:
C19H17F2N5O2
Mol. Mass.:
385.3674
SMILES:
Cc1c(F)c(F)cc2OCCCCn3cnnc3-c3cccc(NC(=O)c12)n3
: