Target
Mitogen-activated protein kinase kinase kinase 5
Ligand
BDBM503668
Substrate
Meas. Tech.
Biochemical Assay
Kd
750±n/a nM
Citation
 Jin, BDong, QHung, G Apoptosis signal-regulating kinase inhibitors and uses thereof US Patent  US11034671 Publication Date 6/15/2021 
Target
Name:
Mitogen-activated protein kinase kinase kinase 5
Synonyms:
ASK1 MAP3K5 MEKK5
Type:
Protein
Mol. Mass.:
154514.93
Organism:
Homo sapiens (Human)
Description:
Q99683
Residue:
1374
  
Inhibitor
Name:
BDBM503668
Synonyms:
US11034671, Example 59
Type:
Small organic molecule
Emp. Form.:
C19H18BrN5O3
Mol. Mass.:
444.282
SMILES:
COc1cc2c(OCCCCn3cnnc3-c3cccc(NC2=O)n3)cc1Br
: