Target
Nuclear receptor ROR-gamma
Ligand
BDBM504169
Substrate
Meas. Tech.
Transcreener-Fluorecescence Polarization Assay
Ki
5.30±n/a nM
Citation
 Bryan, MCDo, SDrobnick, JGobbi, AKatsumoto, TKiefer, Jr., JRLiang, JRajapaksa, NSChen, YFu, LLai, KWLiu, ZWai, JWang, F Pyrazolo[ 1,5a]pyrimidine derivatives as IRAK4 modulators US Patent  US11034698 Publication Date 6/15/2021 
Target
Name:
Nuclear receptor ROR-gamma
Synonyms:
NR1F3 Nuclear receptor ROR-gamma (RORC) RAR-related orphan receptor C (RORc) RORG RZRG Retinoid-related orphan receptor-gamma (RORc)
Type:
Enzyme Catalytic Domain
Mol. Mass.:
58218.40
Organism:
Homo sapiens (Human)
Description:
P51449
Residue:
518
  
Inhibitor
Name:
BDBM504169
Synonyms:
US11034698, Example 6 | US11034698, Example 7
Type:
Small organic molecule
Emp. Form.:
C27H33N7O3
Mol. Mass.:
503.596
SMILES:
CC1(C)Cc2cc(NC(=O)c3cnn4cccnc34)c(cc2O1)N1CCN(C[C@@H]2CCCC(=O)N2)CC1
: