Target
Nuclear receptor ROR-gamma
Ligand
BDBM504256
Substrate
Meas. Tech.
Transcreener-Fluorecescence Polarization Assay
Ki
2.10±n/a nM
Citation
 Bryan, MCDo, SDrobnick, JGobbi, AKatsumoto, TKiefer, Jr., JRLiang, JRajapaksa, NSChen, YFu, LLai, KWLiu, ZWai, JWang, F Pyrazolo[ 1,5a]pyrimidine derivatives as IRAK4 modulators US Patent  US11034698 Publication Date 6/15/2021 
Target
Name:
Nuclear receptor ROR-gamma
Synonyms:
NR1F3 Nuclear receptor ROR-gamma (RORC) RAR-related orphan receptor C (RORc) RORG RZRG Retinoid-related orphan receptor-gamma (RORc)
Type:
Enzyme Catalytic Domain
Mol. Mass.:
58218.40
Organism:
Homo sapiens (Human)
Description:
P51449
Residue:
518
  
Inhibitor
Name:
BDBM504256
Synonyms:
(R)-N-(6-(4-(2-(1H-Imidazol-1- yl)ethyl)piperazin-1-yl)-2-(2- fluoro-3-hydroxy-3- methylbutyl)-1-oxoisoindolin-5- yl)pyrazolo[1,5-a]pyrimidine-3- carboxamide | US11034698, Example 106
Type:
Small organic molecule
Emp. Form.:
C29H34FN9O3
Mol. Mass.:
575.6372
SMILES:
CC(C)(O)[C@H](F)CN1Cc2cc(NC(=O)c3cnn4cccnc34)c(cc2C1=O)N1CCN(CCn2ccnc2)CC1
: