Target
Metabotropic glutamate receptor 4
Ligand
BDBM504284
Substrate
Meas. Tech.
Biological Assay
EC50
43.0±n/a nM
Citation
 Biemans, BGuba, WJaeschke, GLindemann, LO''Hara, FRicci, ARueher, DVieira, E Ethynyl derivatives US Patent  US11034699 Publication Date 6/15/2021 
Target
Name:
Metabotropic glutamate receptor 4
Synonyms:
GPRC1D GRM4_HUMAN MGLUR4 Metabotropic glutamate receptor 4 (mGlu4) metabotropic glutamate 4
Type:
Protein
Mol. Mass.:
101899.95
Organism:
Homo sapiens (Human)
Description:
Q14833
Residue:
912
  
Inhibitor
Name:
BDBM504284
Synonyms:
(6S)-3-[2,6-Difluoro-4-[2-(3-pyridyl)ethynyl]phenyl]-1-methyl-spiro[hexahydropyrimidine-6,4′-isochromane]-2,4-dione | US11034699, Example 10
Type:
Small organic molecule
Emp. Form.:
C26H19F2N3O3
Mol. Mass.:
459.4442
SMILES:
CN1C(=O)N(C(=O)C[C@]11COCc2ccccc12)c1c(F)cc(cc1F)C#Cc1cccnc1
: