Target
5'-nucleotidase
Ligand
BDBM420003
Substrate
Meas. Tech.
Enzyme In Vitro Assay
IC50
74.0±n/a nM
Citation
 Billedeau, RJLi, JChen, L Ectonucleotidase inhibitors and methods of use thereof US Patent  US11034715 Publication Date 6/15/2021 
Target
Name:
5'-nucleotidase
Synonyms:
5'-NT 5NTD_HUMAN Ecto-5'-nucleotidase NT5 NTE
Type:
Enzyme
Mol. Mass.:
63371.54
Organism:
Homo sapiens (Human)
Description:
P21589
Residue:
574
  
Inhibitor
Name:
BDBM420003
Synonyms:
US10472364, Compound 76 US11034715, Cpd. # 76 | US11208414, Cpd. # 76
Type:
Small organic molecule
Emp. Form.:
C19H17ClFN5O9S
Mol. Mass.:
545.883
SMILES:
Nc1nc(Cl)nc2n(cnc12)[C@@H]1O[C@H](COC(Cc2csc(c2)C(O)=O)(C(O)=O)C(O)=O)[C@@H](O)[C@@H]1F
: