Target
FMR1 autosomal homolog 1
Ligand
BDBM504302
Substrate
Meas. Tech.
AlphaScreen Assay
EC50
900±100 nM
Citation
 Pellicciari, RGioiello, A Farnesoid X receptor modulators US Patent  US11034717 Publication Date 6/15/2021 
Target
Name:
FMR1 autosomal homolog 1
Synonyms:
Type:
Protein
Mol. Mass.:
69744.00
Organism:
Dog
Description:
A0A8I3PAF1
Residue:
621
  
Inhibitor
Name:
BDBM504302
Synonyms:
3α,7α,11β,23-tetrahydroxy-6α-ethyl-24-nor-5β-cholan-23-O-sulphate sodium salt | US11034717, Compound 3
Type:
Small organic molecule
Emp. Form.:
C25H44O7S
Mol. Mass.:
488.678
SMILES:
CC[C@H]1[C@@H](O)C2C3CC[C@H]([C@H](C)CCOS(O)(=O)=O)[C@@]3(C)C[C@H](O)C2[C@@]2(C)CC[C@@H](O)C[C@@H]12
: