Target
RNA-binding protein FXR1
Ligand
BDBM504304
Substrate
Meas. Tech.
AlphaScreen Assay
EC50
120±20 nM
Citation
 Pellicciari, RGioiello, A Farnesoid X receptor modulators US Patent  US11034717 Publication Date 6/15/2021 
Target
Name:
RNA-binding protein FXR1
Synonyms:
FXR1_MOUSE Fxr1 mFxr1p
Type:
Protein
Mol. Mass.:
76224.09
Organism:
Mouse
Description:
Q61584
Residue:
677
  
Inhibitor
Name:
BDBM504304
Synonyms:
3α,7α,11β-rihydroxy-6α-ethyl-5β-cholan-24-O-sulphate, sodium salt | US11034717, Compound 5
Type:
Small organic molecule
Emp. Form.:
C26H45NaO7S
Mol. Mass.:
524.686
SMILES:
CC[C@H]1[C@@H](O)C2C3CC[C@H]([C@H](C)CCCOS(=O)(=O)O[Na])[C@@]3(C)C[C@H](O)C2[C@@]2(C)CC[C@@H](O)C[C@@H]12
: