Target
Non-receptor tyrosine-protein kinase TYK2
Ligand
BDBM406676
Substrate
Meas. Tech.
ATP Caliper Assay
IC50
74.1±n/a nM
Citation
 Greenwood, JRMasse, CELawson, JPArlin, JPearson, DLoughrey, JJ TYK2 inhibitors, uses, and methods for production thereof US Patent  US11040967 Publication Date 6/22/2021 
Target
Name:
Non-receptor tyrosine-protein kinase TYK2
Synonyms:
Non-receptor tyrosine-protein kinase TYK2 (TYK2) TYK2_HUMAN | Tyrosine-protein kinase TYK2
Type:
Protein
Mol. Mass.:
133666.03
Organism:
Homo sapiens (Human)
Description:
P29597
Residue:
1187
  
Inhibitor
Name:
BDBM406676
Synonyms:
US10336752, Compound 15 | US11040967, Compound 15
Type:
Small organic molecule
Emp. Form.:
C23H18F2N4O2
Mol. Mass.:
420.4114
SMILES:
Fc1cccc(F)c1-c1cc(Nc2ccc(cc2)C(=O)N2CCC2)c2C(=O)NCc2n1
: