Target
Tyrosine-protein kinase BTK
Ligand
BDBM504409
Substrate
Meas. Tech.
Enzymatic Activity Assay
IC50
0.300±n/a nM
Citation
 Owens, TVerner, E Substituted pyrazolo[3,4-d]pyrimidines as kinase inhibitors US Patent  US11040980 Publication Date 6/22/2021 
Target
Name:
Tyrosine-protein kinase BTK
Synonyms:
AGMX1 Agammaglobulinaemia tyrosine kinase B cell progenitor kinase BPK BTK_HUMAN Tyrosine Kinase BTK Tyrosine-protein kinase BTK (BTK)
Type:
Enzyme
Mol. Mass.:
76289.95
Organism:
Homo sapiens (Human)
Description:
Q06187
Residue:
659
  
Inhibitor
Name:
BDBM504409
Synonyms:
2-[[(3R)-3-[4-amino-3-(2-fluoro-4-phenoxyphenyl)-1H-pyrazolo[3,4-d]pyrimidin-1-yl]-piperidin-1-yl]carbonyl]-4-methyl-4-(4-methylpiperazin-1-yl)pent-2-enenitrile | US11040980, Example 4
Type:
Small organic molecule
Emp. Form.:
C34H39FN9O2
Mol. Mass.:
624.731
SMILES:
CN1CCN(CC1)C(C)(C)C=C(C#N)C(=O)N1CCC[C@H](C1)N1C=[N](c2c1ncnc2N)c1ccc(Oc2ccccc2)cc1F
: