Target
Tyrosine-protein kinase BTK
Ligand
BDBM143183
Substrate
Meas. Tech.
Enzymatic Activity Assay
IC50
0.900±n/a nM
Citation
 Owens, TVerner, E Substituted pyrazolo[3,4-d]pyrimidines as kinase inhibitors US Patent  US11040980 Publication Date 6/22/2021 
Target
Name:
Tyrosine-protein kinase BTK
Synonyms:
AGMX1 Agammaglobulinaemia tyrosine kinase B cell progenitor kinase BPK BTK_HUMAN Tyrosine Kinase BTK Tyrosine-protein kinase BTK (BTK)
Type:
Enzyme
Mol. Mass.:
76289.95
Organism:
Homo sapiens (Human)
Description:
Q06187
Residue:
659
  
Inhibitor
Name:
BDBM143183
Synonyms:
US11040980, Example 8A US9266895, 8 | US9994576, 8
Type:
Small organic molecule
Emp. Form.:
C34H38FN9O2
Mol. Mass.:
623.723
SMILES:
CN1CCN(CC1)C(C)(C)C=C(C#N)C(=O)N1CCC[C@H]1Cn1nc(-c2ccc(Oc3ccccc3)cc2F)c2c(N)ncnc12
: