Target
Interleukin-1 receptor-associated kinase 4
Ligand
BDBM504423
Substrate
Meas. Tech.
Biochemical Assay
IC50
200±n/a nM
Citation
 Crew, APAraujo, E Compounds and methods for the targeted degradation of interleukin-1 receptor- associated kinase 4 polypeptides US Patent  US11065231 Publication Date 7/20/2021 
Target
Name:
Interleukin-1 receptor-associated kinase 4
Synonyms:
IRAK-4 IRAK4_HUMAN Interleukin-1 receptor-associated kinase 4 (IRAK4) | Renal carcinoma antigen NY-REN-64
Type:
Protein
Mol. Mass.:
51519.08
Organism:
Homo sapiens (Human)
Description:
Q9NWZ3
Residue:
460
  
Inhibitor
Name:
BDBM504423
Synonyms:
N-(5-((4-(2-(2-((2-(2,6- dioxopiperidin-3-yl)-1,3- dioxoisoindolin-5- yl)oxy)ethoxy)ethyl)piperazin- 1-yl)methyl)-1-((1s,4s)-4- methylcyclohexyl)-1H- benzo[d]imidazol-2-yl)-3- (trifluoromethyl)benzamide | US11065231, Example 7
Type:
Small organic molecule
Emp. Form.:
C44H48F3N7O7
Mol. Mass.:
843.8898
SMILES:
C[C@H]1CCC(CC1)n1c(NC(=O)c2cccc(c2)C(F)(F)F)nc2cc(CN3CCN(CCOCCOc4ccc5C(=O)N(C6CCC(=O)NC6=O)C(=O)c5c4)CC3)ccc12
: