Target
Interleukin-1 receptor-associated kinase 4
Ligand
BDBM504491
Substrate
Meas. Tech.
Biochemical Assay
IC50
>1000±n/a nM
Citation
 Crew, APAraujo, E Compounds and methods for the targeted degradation of interleukin-1 receptor- associated kinase 4 polypeptides US Patent  US11065231 Publication Date 7/20/2021 
Target
Name:
Interleukin-1 receptor-associated kinase 4
Synonyms:
IRAK-4 IRAK4_HUMAN Interleukin-1 receptor-associated kinase 4 (IRAK4) | Renal carcinoma antigen NY-REN-64
Type:
Protein
Mol. Mass.:
51519.08
Organism:
Homo sapiens (Human)
Description:
Q9NWZ3
Residue:
460
  
Inhibitor
Name:
BDBM504491
Synonyms:
US11065231, Example 68
Type:
Small organic molecule
Emp. Form.:
C43H40F3N7O6
Mol. Mass.:
807.8162
SMILES:
CN(CCOc1ccc2C(=O)N(C3CCC(=O)NC3=O)C(=O)c2c1)c1cccc(c1)-n1c(NC(=O)c2cccc(c2)C(F)(F)F)nc2cc(CN3CCCCC3)ccc12
: